{"text_format":"1","workbook":"xlsx","n_sheets":17,"sheets":["Onglet 2 Méthodologie","ConsulationEVAL","Grille1","Grille2","ConsultationRPS","Base1","Menu","Base2","Resultats","Evolutions","Mode d'emploi","selection","erreurs","calcul","expert","calcul2","Plan"],"not_rendered":{"charts":5,"images":31,"macros":1,"external_links":0,"defined_names":10,"comments":0,"pivot_tables":0},"unopened":[],"bounds":{"document_bytes":16777216,"sheet_cells":100000,"rows_first":2000,"rows_last":500,"rows_between":2000,"halvings":0,"cell_chars":16384,"cell_head_chars":4096},"cells_cut":0,"cells_raw":0,"read":"whole","date_system":"1900"}

{"sheet":"Onglet 2 Méthodologie","index":0,"n_rows":45,"n_cols":11,"rows_kept":45,"cut":false,"hidden":true,"merged":[]}
["Nombre de feuille",17]
[]
[]
[]
[]
[]
[]
[]
[]
[]
[]
[]
[]
[]
[]
{"$rows_left_out":31}
{"sheet":"ConsulationEVAL","index":1,"n_rows":93,"n_cols":12,"rows_kept":93,"cut":false,"hidden":true,"merged":[[0,0,0,11],[6,10,6,11],[8,9,8,10],[10,3,10,4],[10,7,12,7],[10,8,10,9]]}
["Grille d'évaluation des risques professionnels en EHPAD"]
[]
[null,null,null,null,null,null,null,"Unité de travail:",null,"AS"]
[null,"Situation dangereuse - Risque",null,null,null,null,null,null,"Effectif:",null,12]
[]
[]
[null,null,null,null,null,null,null,null,"Rédacteurs:"]
[]
[null,null,null,null,null,null,null,null,"Date:","2016-03-02"]
[]
[null,null,"Dommage","Risque",null,"Priorité","Mesures de prévention","Date de réalisation","Risque résiduel",null,"Priorité","Mesures de prévention"]
["Famille","Situation dangereuse (champ obligatoire)","Lésion","Grav","Fréq","1 à 3","existantes",null,"Grav","Fréq","1 à 3","à proposer"]
["Ne pas enlever","Ne pas enlever",null,"1 à 4","1 à 4",null,null,null,"1 à 4","1 à 4"]
["Transport","Contrainte posturale en transfert d'un résident","Lumbagos",3,4,{"$f":"IF(ISERROR(INDEX('Onglet 2 Méthodologie'!$E$39:$H$42,E14,D14)),\"\",INDEX('Onglet 2 Méthodologie'!$E$39:$H$42,E14,D14))","v":1},"Lit médicalisé, chariot de transfert et formation","2012-03-03",2,4,{"$f":"IF(ISERROR(INDEX('Onglet 2 Méthodologie'!$E$39:$H$42,J14,I14)),\"\",INDEX('Onglet 2 Méthodologie'!$E$39:$H$42,J14,I14))","v":2},"Rail plafonnier"]
["Risques liés à la présence de substances","Sol glissant (urine…)","Traumatisme lié aux chutes",3,2,{"$f":"IF(ISERROR(INDEX('Onglet 2 Méthodologie'!$E$39:$H$42,E15,D15)),\"\",INDEX('Onglet 2 Méthodologie'!$E$39:$H$42,E15,D15))","v":2},"Sensibilisation","2014-02-02",3,2,{"$f":"IF(ISERROR(INDEX('Onglet 2 Méthodologie'!$E$39:$H$42,J15,I15)),\"\",INDEX('Onglet 2 Méthodologie'!$E$39:$H$42,J15,I15))","v":2}]
{"$rows_left_out":79}
{"sheet":"Grille1","index":2,"n_rows":93,"n_cols":13,"rows_kept":93,"cut":false,"hidden":true,"merged":[[10,0,12,0],[0,0,0,11],[8,9,8,10],[10,1,12,1],[10,3,10,4],[10,7,12,7],[10,8,10,9]]}
["Grille d'évaluation des risques professionnels en EHPAD"]
[]
[null,null,null,null,null,null,null,"Unité de travail:"]
[null,"Situation dangereuse - Risque",null,null,null,null,null,null,"Effectif:"]
[]
[null,"Gravité des dommages :  1 = accident ou maladie sans arrêt de travail    2 = accident ou maladie avec arrêt de travail "]
[null,"3 = accident ou maladie avec incapacité permanente partielle   4 = très grave accident ou maladie mortel",null,null,null,null,null,null,"Rédacteurs:"]
[null,"Fréquence d'exposition des salariés aux dangers:  1=  de l'ordre de 1 fois/an    2 = de l'ordre de 1 fois/mois "]
[null,"3 = de l'ordre de 1 fois/semaine    4 = très fréquente exposition quotidienne ou permanente ",null,null,null,null,null,null,"Date:",{"$f":"TODAY()","v":"2021-06-18"}]
[]
["Familles de risques\n(facultatif)","Situation dangereuse (champ obligatoire)","Dommage","Risque",null,"Priorité","Mesures de prévention","Date de réalisation","Risque résiduel",null,"Priorité","Mesures de prévention","Double cliquer"]
[null,null,"Lésion","Grav","Fréq","1 à 3","existantes",null,"Grav","Fréq","1 à 3","à proposer"]
[null,null,null,"1 à 4","1 à 4",null,null,null,"1 à 4","1 à 4"]
[null,null,null,null,null,{"$f":"IF(ISERROR(INDEX('Onglet 2 Méthodologie'!$E$39:$H$42,E14,D14)),\"\",INDEX('Onglet 2 Méthodologie'!$E$39:$H$42,E14,D14))","v":""},null,null,null,null,{"$f":"IF(ISERROR(INDEX('Onglet 2 Méthodologie'!$E$39:$H$42,J14,I14)),\"\",INDEX('Onglet 2 Méthodologie'!$E$39:$H$42,J14,I14))","v":""},null,"Plan d'actions"]
[null,null,null,null,null,{"$f":"IF(ISERROR(INDEX('Onglet 2 Méthodologie'!$E$39:$H$42,E15,D15)),\"\",INDEX('Onglet 2 Méthodologie'!$E$39:$H$42,E15,D15))","v":""},null,null,null,null,{"$f":"IF(ISERROR(INDEX('Onglet 2 Méthodologie'!$E$39:$H$42,J15,I15)),\"\",INDEX('Onglet 2 Méthodologie'!$E$39:$H$42,J15,I15))","v":""},null,"Plan d'actions"]
{"$rows_left_out":79}
{"sheet":"Grille2","index":3,"n_rows":52,"n_cols":27,"rows_kept":52,"cut":false,"hidden":true,"merged":[[0,1,0,11],[8,9,8,10],[10,3,10,5],[10,6,11,6],[10,7,11,7],[10,8,10,10],[10,11,11,11],[11,3,11,5],[11,8,11,10]]}
[null,"Grille d'évaluation des risques professionnels en EHPAD",null,null,null,null,null,null,null,null,null,null,null,null,null,null,null,null,null,null,null,null,null,null,null,null,"Oui"]
[null,null,null,null,null,null,null,null,null,null,null,null,null,null,null,null,null,null,null,null,null,null,null,null,null,null,"Non"]
[null,null,null,null,null,null,null,"Unité de travail:"]
[null,"Famille de facteurs de RPS - Niveau d'intensité des risques",null,null,null,null,null,null,"Effectif:"]
[]
[]
[null,null,null,null,null,null,null,null,"Rédacteurs:"]
[]
[null,null,null,null,null,null,null,null,"Date:",{"$f":"TODAY()","v":"2021-06-18"}]
[null,null,null,"(Cochez par une croix la case choisie)",null,null,null,null,"(Cochez par une croix la case choisie)"]
[null,"Famille de facteurs ",null,"Niveau d'intensité",null,null,"Mesures de prévention","Date de réalisation","Niveau d'intensité",null,null,"Mesures de prévention"]
[null,"de RPS","Ëtes-vous concerné?","des facteurs de risque",null,null,null,null,"des facteurs de risque"]
[null,"---",null,null,null,null,"existantes",null,null,null,null,"à proposer"]
[null,"Intensité et complexité du travail"]
[null,"Contraintes de rythmes de travail","Oui"]
{"$rows_left_out":38}
{"sheet":"ConsultationRPS","index":4,"n_rows":52,"n_cols":27,"rows_kept":52,"cut":false,"hidden":true,"merged":[[0,1,0,11],[6,10,6,11],[8,9,8,10],[10,3,10,5],[10,6,11,6],[10,7,11,7],[10,8,10,10],[10,11,11,11],[11,3,11,5],[11,8,11,10]]}
[null,"Grille d'évaluation des risques professionnels en EHPAD",null,null,null,null,null,null,null,null,null,null,null,null,null,null,null,null,null,null,null,null,null,null,null,null,"Oui"]
[null,null,null,null,null,null,null,null,null,null,null,null,null,null,null,null,null,null,null,null,null,null,null,null,null,null,"Non"]
[null,null,null,null,null,null,null,"Unité de travail:",null,"IDE"]
[null,"Famille de facteurs de RPS - Niveau d'intensité des risques",null,null,null,null,null,null,"Effectif:",null,3]
[]
[]
[null,null,null,null,null,null,null,null,"Rédacteurs:"]
[]
[null,null,null,null,null,null,null,null,"Date:","2016-03-02"]
[null,null,null,"(Cochez par une croix la case choisie)",null,null,null,null,"(Cochez par une croix la case choisie)"]
[null,"Famille de facteurs ",null,"Niveau d'intensité",null,null,"Mesures de prévention","Date de réalisation","Niveau d'intensité",null,null,"Mesures de prévention"]
[null,"de RPS","Ëtes-vous concerné?","des facteurs de risque",null,null,null,null,"des facteurs de risque"]
[null,"---",null,null,null,null,"existantes",null,null,null,null,"à proposer"]
[null,"Intensité et complexité du travail"]
[null,"Contraintes de rythmes de travail","Oui",null,"X",null,"Fixer la charge de travail et les objectifs en tenant de l'activité et de ces aléas","2014-02-01"]
{"$rows_left_out":38}
{"sheet":"Base1","index":5,"n_rows":16,"n_cols":16,"rows_kept":16,"cut":false,"hidden":true,"merged":[]}
["Date de transfert","Unité","Situation Dangereuse","Priorité initiale","Priorité finale","Dommage","Grav","Fréq","Mesures de prévention","Date de réalisation","Grav","Fréq","Mesures de prévention","effectif","redacteurs","Famille"]
["2016-03-02","Lingere","Manutention de sac de linge",1,2,"Lumbago et TMS",3,4,"Table de tri à hauteur variable","2016-02-01",2,4,"Sac à ouverture latérale, limitation du volume des sacs, organisation du circuit de collecte des sacs",2,"Mr DUPOND et Mme THIERRY","Activité physique"]
["2016-03-02","Lingere","Manipulation de produit lessiviel",1,2,"Intoxication et brolure chimique",3,4,"Alimentation par pompe doseuse","2016-03-15",3,2,"Sensibilisation à la lecture des pictogrammes",2,"Mr DUPOND et Mme THIERRY","Chute"]
["2016-03-02","Lingere","Température des locaux élevée",2,2,"Malaise",2,4,"Aeration naturelle","2016-03-15",2,4,"Climatisation des locaux",2,"Mr DUPOND et Mme THIERRY","Risques liés à la présence de substances"]
["2016-03-02","Lingere","Déplacement dans les escaliers",1,2,"Traumatisme",3,4,"Fixer des bandes rugueuses sur les nez-de-marche","2013-10-09",2,4,null,2,"Mr DUPOND et Mme THIERRY","Risques majeurs naturels"]
["2016-03-02","Lingere","Evolution des salariés sur sols humides et/ou glissant",1,null,"chute",3,4,null,null,null,null,null,2,"Mr DUPOND et Mme THIERRY","Risques liés à la présence de substances"]
["2016-07-15","Lingere","Manutention de sac de linge",2,3,"Lumbago et TMS",null,null,"Table de tri à hauteur variable","2016-02-01",null,null,"Sac à ouverture latérale, limitation du volume des sacs, organisation du circuit de collecte des sacs",2,"Mr DUPOND et Mme THIERRY"]
["2016-07-15","Lingere","Manipulation de produit lessiviel",2,3,"Intoxication et brolure chimique",null,null,"Alimentation par pompe doseuse","2016-03-15",null,null,"Sensibilisation à la lecture des pictogrammes",2,"Mr DUPOND et Mme THIERRY"]
["2016-07-15","Lingere","Température des locaux élevée",2,3,"Malaise",null,null,"Aeration naturelle","2016-03-15",null,null,"Climatisation des locaux",2,"Mr DUPOND et Mme THIERRY"]
["2016-07-15","Lingere","Déplacement dans les escaliers",2,3,"Traumatisme",null,null,"Fixer des bandes rugueuses sur les nez-de-marche","2013-10-09",null,null,null,2,"Mr DUPOND et Mme THIERRY"]
["2016-07-15","Lingere","Evolution des salariés sur sols humides et/ou glissant",1,2,"chute",null,null,null,null,null,null,null,2,"Mr DUPOND et Mme THIERRY"]
["2016-08-15","Lingere","Manutention de sac de linge",3,3,"Lumbago et TMS",null,null,"Table de tri à hauteur variable","2016-02-01",null,null,"Sac à ouverture latérale, limitation du volume des sacs, organisation du circuit de collecte des sacs",2,"Mr DUPOND et Mme THIERRY"]
["2016-08-15","Lingere","Manipulation de produit lessiviel",3,3,"Intoxication et brolure chimique",null,null,"Alimentation par pompe doseuse","2016-03-15",null,null,"Sensibilisation à la lecture des pictogrammes",2,"Mr DUPOND et Mme THIERRY"]
["2016-08-15","Lingere","Température des locaux élevée",3,3,"Malaise",null,null,"Aeration naturelle","2016-03-15",null,null,"Climatisation des locaux",2,"Mr DUPOND et Mme THIERRY"]
["2016-08-15","Lingere","Déplacement dans les escaliers",3,3,"Traumatisme",null,null,"Fixer des bandes rugueuses sur les nez-de-marche","2013-10-09",null,null,null,2,"Mr DUPOND et Mme THIERRY"]
{"$rows_left_out":2}
{"sheet":"Menu","index":6,"n_rows":25,"n_cols":8,"rows_kept":25,"cut":false,"hidden":false,"merged":[]}
[]
[]
[]
[]
[]
[]
[null,null,null,null,null,null,"Outil d'évaluation des risques","Version A2"]
[null,null,null,null,null,null,"Attention: pour la méthodologie, reportez vous au  guide d'évaluation des risques"]
[]
[]
[]
[]
[]
[null,null,null,null,"Phase 1:","Gérer vos unités de travail"]
[]
{"$rows_left_out":11}
{"sheet":"Base2","index":7,"n_rows":53,"n_cols":12,"rows_kept":53,"cut":false,"hidden":true,"merged":[]}
["Date de transfert","Unité","Famille","RPS","Niveau d'intensité initiale","Niveau d'intensité finale","Ëtes-vous concerné?","Mesures de prévention","Date de réalisation","Mesures de prévention","effectif","redacteurs"]
["2016-03-02","Lingere","Intensité et complexité du travail","Contraintes de rythmes de travail","Modéré","Faible","Oui","Fixer la charge de travail et les objectifs en tenant de l'activité et de ces aléas","2014-02-01",null,2,"Mr DUPOND et Mme THIERRY"]
["2016-03-02","Lingere","Intensité et complexité du travail","Niveau de précision des objectifs de travail","Faible","Aucune Mesure","Oui",null,null,"Définition colaborative des objectifs lors de l'entretien professionnel",2,"Mr DUPOND et Mme THIERRY"]
["2016-03-02","Lingere","Intensité et complexité du travail","Adéquation des objectifs avec les moyens et les responsabilités","Faible","Aucune Mesure","Oui",null,null,null,2,"Mr DUPOND et Mme THIERRY"]
["2016-03-02","Lingere","Intensité et complexité du travail","Compatibilité des instructions de travail entre elles","Modéré","Faible","Oui","Mettre en place des réunions d'échange sur les problématiques liés à leur travail",null,null,2,"Mr DUPOND et Mme THIERRY"]
["2016-03-02","Lingere","Intensité et complexité du travail","Gestion de la polyvalence","Aucune Mesure","Aucune Mesure","Non",null,null,null,2,"Mr DUPOND et Mme THIERRY"]
["2016-03-02","Lingere","Intensité et complexité du travail","Interruption dans le travail ","Modéré","Faible","Oui","Idenfier les interruptions inévitables et celles qui peuvent être différés","2015-02-09",null,2,"Mr DUPOND et Mme THIERRY"]
["2016-03-02","Lingere","Intensité et complexité du travail","Attention et vigilance dans le travail","Aucune Mesure","Aucune Mesure","Non",null,null,null,2,"Mr DUPOND et Mme THIERRY"]
["2016-03-02","Lingere","Horaires de travail difficiles","Durée hebdomadaire du travail","Aucune Mesure","Aucune Mesure","Non",null,null,null,2,"Mr DUPOND et Mme THIERRY"]
["2016-03-02","Lingere","Horaires de travail difficiles","Travail en horaires atypiques","Aucune Mesure","Aucune Mesure","Non",null,null,null,2,"Mr DUPOND et Mme THIERRY"]
["2016-03-02","Lingere","Horaires de travail difficiles","Extension de la disponibilité en dehors des horaires de travail","Aucune Mesure","Aucune Mesure","Non",null,null,null,2,"Mr DUPOND et Mme THIERRY"]
["2016-03-02","Lingere","Horaires de travail difficiles","Prévisibilité des horaires de travail et anticipation de leur changement","Aucune Mesure","Aucune Mesure","Non",null,null,null,2,"Mr DUPOND et Mme THIERRY"]
["2016-03-02","Lingere","Horaires de travail difficiles","Conciliation entre vie professionnelle et vie personnelle","Modéré","Faible","Oui","Réaliser des entretiens individuelles","2014-10-22",null,2,"Mr DUPOND et Mme THIERRY"]
["2016-03-02","Lingere","Exigence émotionnelles","Tensions avec le public","Aucune Mesure","Aucune Mesure","Non",null,null,null,2,"Mr DUPOND et Mme THIERRY"]
["2016-03-02","Lingere","Exigence émotionnelles","Confrontation à la souffrance d'autrui","Aucune Mesure","Aucune Mesure","Non",null,null,null,2,"Mr DUPOND et Mme THIERRY"]
{"$rows_left_out":39}
{"sheet":"Resultats","index":8,"n_rows":78,"n_cols":11,"rows_kept":78,"cut":false,"hidden":true,"merged":[[68,8,68,10]]}
[]
[]
[null,null,null,"Baromètre de maitrise des risques"]
[]
[]
[]
[]
[]
[null,null,"UNITE DE TRAVAIL A VISUALISER"]
[]
[]
[]
[null,null,"DATE D'ENREGISTREMENT"]
[]
[]
{"$rows_left_out":64}
{"sheet":"Evolutions","index":9,"n_rows":99,"n_cols":14,"rows_kept":99,"cut":false,"hidden":true,"merged":[[89,9,89,11],[89,12,89,14]]}
[]
[]
[null,null,null,"Evolution de la maitrise des risques entre deux dates"]
[]
[]
[]
[]
[null,null,"UNITE DE TRAVAIL A VISUALISER"]
[]
[]
[null,null,"Point de comparaison entre deux dates"]
[]
[null,null,"DATE D'ENREGISTREMENT initiale"]
[]
[null,null,"DATE D'ENREGISTREMENT finale"]
{"$rows_left_out":85}
{"sheet":"Mode d'emploi","index":10,"n_rows":76,"n_cols":3,"rows_kept":76,"cut":false,"hidden":true,"merged":[]}
[]
[]
[]
[null,"MODE D'EMPLOI - Outil d'évaluation des risques version A1"]
[]
[]
[]
[]
["1)","Menu"]
[]
[null,null,"Mode d'emploi de l'outil\n\nVideo de démonstration de l'outil ( acces internet impératif)\n\nMode expert: Supprimer des points d'enregistrements et de consulter des versions précédentes\n\nCréation des unités de travail pour évaluer les risques\n\nListe déroulante correspondant au choix de l'unité de travail à visualiser\n\n\nAnalyse de la situation de vos unités de travail"]
[]
[]
["2)","1er étape: Gérer vos unités de travail"]
[null,"Cliquez sur le bouton \"Créer vos unités de travail\", la boite de dialogue ci-dessous s'ouvre et vous demande de renseigner l'ensemble de  vos unités de travail."]
{"$rows_left_out":62}
{"sheet":"selection","index":11,"n_rows":0,"n_cols":0,"rows_kept":0,"cut":false,"hidden":true,"merged":[]}

{"sheet":"erreurs","index":12,"n_rows":0,"n_cols":0,"rows_kept":0,"cut":false,"hidden":true,"merged":[]}

{"sheet":"calcul","index":13,"n_rows":12,"n_cols":9,"rows_kept":12,"cut":false,"hidden":true,"merged":[]}
["Janvier",2015,1,{"$f":"Resultats!G23","v":"2016-03-02"},{"$f":"VLOOKUP($D$1,$A$1:$C$12,3,0)","v":{"$error":"#N/A"}},"15/02/2016 2016",1,"Janvier","MOBILISATION DE PERSONNES DÉPENDANTES"]
["Février",2016,2,{"$f":"VLOOKUP(E2,G1:H12,2,0)","v":"Février"},2,"15/02/2016 2016",2,"Février","TROUBLES DU COMPORTEMENT DU RÉSIDENT"]
["Mars",2017,3,null,null,{"$f":"DATEDIF(F1,F2,\"m\")+1","v":{"$error":"#VALUE!"}},3,"Mars","MANUTENTION MANUELLE D’OBJETS"]
["Avril",2018,4,null,null,null,4,"Avril","UTILISATION D’ÉQUIPEMENTS DE TRAVAIL DE NETTOYAGE"]
["Mai",2019,5,null,null,null,5,"Mai","LA CIRCULATION ET LE DÉPLACEMENT DES SALARIÉS"]
["Juin",2020,6,null,null,null,6,"Juin","LA CIRCULATION ROUTIÈRE"]
["Juillet",2021,7,null,null,null,7,"Juillet","UTILISATION ET STOCKAGE DE PRODUITS CHIMIQUES"]
["Août",2022,8,null,null,null,8,"Août","L’EXPOSITION À DES AGENTS INFECTIEUX"]
["Septembre",2023,9,null,null,null,9,"Septembre","L’EXPOSITION A DES AMBIANCES PHYSIQUES CONTRAIGNANTES"]
["Octobre",2024,10,null,null,null,10,"Octobre","L’UTILISATION D’ORDINATEURS ET DE TABLETTES"]
["Novembre",2025,11,null,null,null,11,"Novembre"]
["Décembre",2026,12,null,null,null,12,"Décembre"]

{"sheet":"expert","index":14,"n_rows":1,"n_cols":2,"rows_kept":1,"cut":false,"hidden":true,"merged":[]}
[null,"AS"]

{"sheet":"calcul2","index":15,"n_rows":8,"n_cols":6,"rows_kept":8,"cut":false,"hidden":true,"merged":[]}
[null,"2016-03-02","2016-04-02","2016-05-02","2016-06-02","2016-07-02"]
["Priorité 1",4,null,null,null,1]
["Priorité 2",8,null,null,null,3]
["Priorité 3",2,null,null,null,10]
[]
["Priorité 1",{"$f":"AVERAGE(2:2)","v":2.5}]
["Priorité 2",{"$f":"AVERAGE(3:3)","v":5.5}]
["Priorité 3",{"$f":"AVERAGE(4:4)","v":6}]

{"sheet":"Plan","index":16,"n_rows":9,"n_cols":9,"rows_kept":9,"cut":false,"hidden":true,"merged":[]}
["Service","Situation Dangereuse","Mesures de prévention","Date","Action","Date","Pilote","Avancement","Etat"]
["AS","Contrainte posturale en transfert d'un résident","Rail plafonnier","20/02/2017","Mettre en place...","15 jours","Francis",40,"En cours"]
["AS","Contrainte posturale en transfert d'un résident","Rail plafonnier","20/02/2017","Monter un ...","3 jours","Joel",60,"Différé"]
["AS","Contact avec du linge souillé ( risque infectieux)","Formation/information pour les nouveaux embauchés","20/02/2017","tirer un cable","1 jours","thierry",0,"Non Planifié"]
["Lingère","Manutention de sac de linge","Sac à ouverture latérale, limitation du volume des sacs, organisation du circuit de collecte des sacs","2016-01-05","test du ...",null,null,null,"Non communiqué"]
["Lingère","Manutention de sac de linge","Sac à ouverture latérale, limitation du volume des sacs, organisation du circuit de collecte des sacs","20/02/2017","choisir le ...",null,null,null,"Non communiqué"]
["Lingère","Manutention de sac de linge","Sac à ouverture latérale, limitation du volume des sacs, organisation du circuit de collecte des sacs","20/02/2017","Placer un ...",null,null,null,"Non communiqué"]
["Lingère","Température des locaux élevée","Climatisation des locaux","20/02/2017","choix de...",null,null,null,"Différé"]
["Lingère","Température des locaux élevée","Climatisation des locaux","20/02/2017","Mettre en place",null,null,null,"Différé"]